Thủ thuật

Tải và cài đặt Visual Studio Code lập trình C/C++ Mac OS

Hiya quý khách. Bữa nay, tôi sẽ đưa ra đánh giá khách quan về hướng dẫn cài visible studio 2015 với bài chia sẽ Tải và cài đặt Visible Studio Code lập trình C/C++ Mac OS

Đa số nguồn đều đc cập nhật ý tưởng từ các nguồn trang internet đầu ngành khác nên chắc chắn có vài phần khó hiểu.

Mong mỗi người thông cảm, xin nhận góp ý và gạch đá bên dưới remark

[su_box title=”Khuyến nghị:” style=”default” box_color=”#3be863″ title_color=”#FFFFFF” radius=”3″]

Quý độc giả vui lòng đọc nội dung này ở nơi riêng tư kín để có hiệu quả cao nhất
Tránh xa toàn bộ những dòng thiết bị gây xao nhoãng trong các công việc đọc bài
Bookmark lại bài viết vì mình sẽ replace thường xuyên

[/su_box]

Nội dung này sẽ giúp bạn tải và cài đặt Visible Studio Code để lập trình C / C ++ trên Mac ================================= ================================================== =============== Trang chủ: Liên kết tải xuống:.

Nguồn tổng hợp

Related Articles

25 Comments

  1. ld: symbol(s) not found for architecture x86_64
    clang: error: linker command failed with exit code 1 (use -v to see invocation)

    [Done] exited with code=1 in 0.099 seconds
    Hiẹn lên lỗi vây là bi gì vây ban. cảm ơn ban nhé

  2. Undefined symbols for architecture arm64:
    "_main", referenced from:
    implicit entry/start for main executable
    ld: symbol(s) not found for architecture arm64
    clang: error: linker command failed with exit code 1 (use -v to see invocation)

  3. Running] cd "/Users/mac/Desktop/code c++/" && gcc test c++ -o /Users/mac/Desktop/code c++/test c++ && "/Users/mac/Desktop/code c++/"/Users/mac/Desktop/code c++/test c++
    xcode-select: note: no developer tools were found at '/Applications/Xcode.app', requesting install. Choose an option in the dialog to download the command line developer tools.
    em bị lỗi gì thế anh

  4. anh ơi em chạy cái nó bị lỗi như vậy ạ
    [Running] cd "/Users/leminhthu/Documents/" && g++ test.cpp -o test && "/Users/leminhthu/Documents/"test
    Undefined symbols for architecture arm64:
    "_main", referenced from:
    implicit entry/start for main executable
    ld: symbol(s) not found for architecture arm64
    clang: error: linker command failed with exit code 1 (use -v to see invocation)

  5. a ơi cho em hỏi s tải về mà em chạy cái nó bị lỗi vầy là sao a ơi
    Undefined symbols for architecture x86_64:
    "_main", referenced from:
    implicit entry/start for main executable
    ld: symbol(s) not found for architecture x86_64
    clang: error: linker command failed with exit code 1 (use -v to see invocation)

  6. Undefined symbols for architecture arm64:
    "_main", referenced from:
    implicit entry/start for main executable
    ld: symbol(s) not found for architecture arm64
    clang: error: linker command failed with exit code 1 (use -v to see invocation)

    lỗi này của em có phải là bị lỗi phần cứng phải không anh. em thấy có dòng không phù hợp vs cấu trúc arm64.

  7. anh cho em hỏi là em đã cài như a làm nhưng vẫn báo lỗi.
    sau khi tìm hiểu thì em có thấy 1 số anh khác bảo cần cài vscode và clang anh ạ.
    em dùng máy mac m1 8G giống anh ạ.
    mong anh cho kẻ mới học nghề này lời khuyên.

Trả lời

Email của bạn sẽ không được hiển thị công khai. Các trường bắt buộc được đánh dấu *

Back to top button

Phát hiện chương trình chặn quảng cáo

Xin vui lòng tắt tiện ích, tính năng chặn quảng cáo để xem nội dung. (Ủng hộ tác giả, xin cảm ơn)